Name Machine Type Up Locked Locked Since Locked By OS Type OS Version Arch Description
gibba037.front.sepia.ceph.com gibba True True 2021-07-28 17:29:47.469147 scheduled_teuthology@teuthology rhel 7.9 x86_64 /home/teuthworker/archive/teuthology-2021-07-23_13:25:03-kcephfs-nautilus-testing-basic-gibba/6288639
Status Job ID Links Posted Started Updated
Runtime
Duration
In Waiting
Machine Teuthology Branch OS Type OS Version Description Nodes
fail 6295739 2021-07-27 04:19:41 2021-07-27 04:35:38 2021-07-27 04:54:13 0:18:35 0:04:42 0:13:53 gibba wip-badone-ceph-ansible-ubutu-upgrade-test ubuntu 20.04 ceph-ansible/smoke/basic/{0-clusters/4-node 1-distros/ubuntu_latest 2-ceph/ceph_ansible 3-config/dmcrypt_off 4-tasks/rbd_import_export} 4
Failure Reason:

Command failed on gibba037 with status 1: "cd ~/ceph-ansible ; virtualenv --python=python3 venv ; source venv/bin/activate ; pip install --upgrade pip ; pip install --upgrade 'cryptography>=2.5' ; pip install setuptools>=11.3 notario>=0.0.13 netaddr six ansible==2.10.0 ; ANSIBLE_STDOUT_CALLBACK=debug ansible-playbook -vv -i inven.yml site.yml"

pass 6291370 2021-07-25 05:01:15 2021-07-25 06:23:21 2021-07-25 06:55:29 0:32:08 0:19:55 0:12:13 gibba master centos 8.stream smoke/basic/{clusters/{fixed-3-cephfs openstack} objectstore/bluestore-bitmap supported-random-distro$/{centos_8.stream} tasks/{0-install test/rbd_python_api_tests}} 3
pass 6291363 2021-07-25 05:01:09 2021-07-25 05:50:20 2021-07-25 06:24:33 0:34:13 0:16:46 0:17:27 gibba master centos 8.3 smoke/basic/{clusters/{fixed-3-cephfs openstack} objectstore/bluestore-bitmap supported-random-distro$/{centos_8} tasks/{0-install test/rados_cls_all}} 3
pass 6291356 2021-07-25 05:01:03 2021-07-25 05:31:34 2021-07-25 05:55:37 0:24:03 0:10:27 0:13:36 gibba master centos 8.3 smoke/basic/{clusters/{fixed-3-cephfs openstack} objectstore/bluestore-bitmap supported-random-distro$/{centos_8} tasks/{0-install test/kclient_workunit_suites_fsstress}} 3
pass 6291351 2021-07-25 05:00:59 2021-07-25 05:07:19 2021-07-25 05:34:38 0:27:19 0:11:16 0:16:03 gibba master ubuntu 20.04 smoke/basic/{clusters/{fixed-3-cephfs openstack} objectstore/bluestore-bitmap supported-random-distro$/{ubuntu_latest} tasks/{0-install test/cfuse_workunit_suites_fsstress}} 3
dead 6288639 2021-07-23 13:26:02 2021-07-28 17:29:47 2021-07-28 17:44:53 0:15:06 0:08:01 0:07:05 gibba master rhel 7.9 kcephfs/recovery/{begin clusters/1-mds-4-client conf/{client mds mon osd} kclient/{mount overrides/{distro/rhel/{k-distro rhel_latest} ms-die-on-skipped}} objectstore-ec/bluestore-ec-root overrides/{frag_enable log-config osd-asserts whitelist_health whitelist_wrongly_marked_down} tasks/sessionmap} 6
Failure Reason:

{'Failure object was': {'gibba041.front.sepia.ceph.com': {'changed': False, 'results': ['yum-plugin-priorities-1.1.31-54.el7_8.noarch providing yum-plugin-priorities is already installed', 'yum-plugin-fastestmirror-1.1.31-54.el7_8.noarch providing yum-plugin-fastestmirror is already installed', 'redhat-lsb-4.1-27.el7.x86_64 providing redhat-lsb is already installed', 'sysstat-10.1.5-19.el7.x86_64 providing sysstat is already installed', 'gdb-7.6.1-120.el7.x86_64 providing gdb is already installed', 'git-all-1.8.3.1-23.el7_8.noarch providing git-all is already installed', 'python-configobj-4.7.2-7.el7.noarch providing python-configobj is already installed', 'gcc-c++-4.8.5-44.el7.x86_64 providing gcc-c++ is already installed', 'libedit-3.0-12.20121213cvs.el7.x86_64 providing libedit is already installed', 'openssl098e-0.9.8e-29.el7_2.3.x86_64 providing openssl098e is already installed', 'boost-thread-1.53.0-28.el7.x86_64 providing boost-thread is already installed', 'xfsprogs-4.5.0-22.el7.x86_64 providing xfsprogs is already installed', 'xfsprogs-devel-4.5.0-22.el7.x86_64 providing xfsprogs-devel is already installed', 'gdisk-0.8.10-3.el7.x86_64 providing gdisk is already installed', 'parted-3.1-32.el7.x86_64 providing parted is already installed', 'libgcrypt-1.5.3-14.el7.x86_64 providing libgcrypt is already installed', 'fuse-2.9.2-11.el7.x86_64 providing fuse is already installed', 'fuse-libs-2.9.2-11.el7.x86_64 providing fuse-libs is already installed', '7:lvm2-2.02.187-6.el7.x86_64 providing lvm2 is already installed', '1:openssl-1.0.2k-19.el7.x86_64 providing openssl is already installed', 'libuuid-2.23.2-65.el7_9.1.x86_64 providing libuuid is already installed', 'btrfs-progs-4.9.1-1.el7.x86_64 providing btrfs-progs is already installed', 'attr-2.4.46-13.el7.x86_64 providing attr is already installed', '1:valgrind-3.15.0-11.el7.x86_64 providing valgrind is already installed', 'python-nose-1.3.7-1.el7.noarch providing python-nose is already installed', 'mpich-3.0-3.0.4-10.el7.x86_64 providing mpich is already installed', 'ant-1.9.4-2.el7.noarch providing ant is already installed', 'lsof-4.87-6.el7.x86_64 providing lsof is already installed', 'iozone-3.424-2_ceph.el7.x86_64 providing iozone is already installed', 'libtool-2.4.2-22.el7_3.x86_64 providing libtool is already installed', 'automake-1.13.4-3.el7.noarch providing automake is already installed', 'gettext-0.19.8.1-3.el7.x86_64 providing gettext is already installed', 'libuuid-devel-2.23.2-65.el7_9.1.x86_64 providing libuuid-devel is already installed', 'libacl-devel-2.2.51-15.el7.x86_64 providing libacl-devel is already installed', 'bc-1.06.95-13.el7.x86_64 providing bc is already installed', 'xfsdump-3.1.7-1.el7.x86_64 providing xfsdump is already installed', 'blktrace-1.0.5-9.el7.x86_64 providing blktrace is already installed', '1:numpy-1.7.1-13.el7.x86_64 providing numpy is already installed', 'python-matplotlib-1.2.0-16.el7.x86_64 providing python-matplotlib is already installed', 'usbredir-0.7.1-3.el7.x86_64 providing usbredir is already installed', 'genisoimage-1.1.11-25.el7.x86_64 providing genisoimage is already installed', 'httpd-2.4.6-97.el7_9.x86_64 providing httpd is already installed', 'httpd-devel-2.4.6-97.el7_9.x86_64 providing httpd-devel is already installed', 'httpd-tools-2.4.6-97.el7_9.x86_64 providing httpd-tools is already installed', '1:mod_ssl-2.4.6-97.el7_9.x86_64 providing mod_ssl is already installed', 'libev-devel-4.15-7.el7.x86_64 providing libev-devel is already installed', 'perl-XML-Twig-3.44-2.el7.noarch providing perl-XML-Twig is already installed', '1:java-1.6.0-openjdk-devel-1.6.0.41-1.13.13.1.el7_3.x86_64 providing java-1.6.0-openjdk-devel is already installed', 'junit-4.11-8.el7.noarch providing junit4 is already installed', '1:nfs-utils-1.3.0-0.68.el7.x86_64 providing nfs-utils is already installed', 'ncurses-devel-5.9-14.20130511.el7_4.x86_64 providing ncurses-devel is already installed', 'python-devel-2.7.5-90.el7.x86_64 providing python-devel is already installed', 'python-virtualenv-15.1.0-4.el7_8.noarch providing python-virtualenv is already installed', 'perl-CPAN-1.9800-299.el7_9.noarch providing perl-CPAN is already installed', 'podman-1.6.4-29.el7_9.x86_64 providing podman is already installed', 'python3-3.6.8-18.el7.x86_64 providing python3 is already installed', 'Loaded plugins: fastestmirror, langpacks, priorities, product-id, search-\\n : disabled-repos, subscription-manager\\nLoading mirror speeds from cached hostfile\\n * epel: download-cc-rdu01.fedoraproject.org\\nResolving Dependencies\\n--> Running transaction check\\n---> Package mod_fastcgi.x86_64 0:2.4.7-1.ceph.el7 will be installed\\n---> Package qemu-kvm.x86_64 10:1.5.3-175.el7_9.4 will be installed\\n--> Processing Dependency: qemu-kvm-common = 10:1.5.3-175.el7_9.4 for package: 10:qemu-kvm-1.5.3-175.el7_9.4.x86_64\\n--> Processing Dependency: qemu-img = 10:1.5.3-175.el7_9.4 for package: 10:qemu-kvm-1.5.3-175.el7_9.4.x86_64\\n--> Processing Dependency: librbd.so.1()(64bit) for package: 10:qemu-kvm-1.5.3-175.el7_9.4.x86_64\\n--> Processing Dependency: librados.so.2()(64bit) for package: 10:qemu-kvm-1.5.3-175.el7_9.4.x86_64\\n--> Running transaction check\\n---> Package librados2.x86_64 1:10.2.5-4.el7 will be installed\\n--> Processing Dependency: libboost_random-mt.so.1.53.0()(64bit) for package: 1:librados2-10.2.5-4.el7.x86_64\\n---> Package librbd1.x86_64 1:10.2.5-4.el7 will be installed\\n---> Package qemu-img.x86_64 10:1.5.3-175.el7_9.4 will be installed\\n---> Package qemu-kvm-common.x86_64 10:1.5.3-175.el7_9.4 will be installed\\n--> Running transaction check\\n---> Package boost-random.x86_64 0:1.53.0-28.el7 will be installed\\n--> Finished Dependency Resolution\\n\\nDependencies Resolved\\n\\n================================================================================\\n Package Arch Version Repository Size\\n================================================================================\\nInstalling:\\n mod_fastcgi x86_64 2.4.7-1.ceph.el7 rhel-7-fcgi-ceph 70 k\\n qemu-kvm x86_64 10:1.5.3-175.el7_9.4 rhel-7-server-rpms 1.9 M\\nInstalling for dependencies:\\n boost-random x86_64 1.53.0-28.el7 rhel-7-server-rpms 39 k\\n librados2 x86_64 1:10.2.5-4.el7 rhel-7-server-rpms 1.8 M\\n librbd1 x86_64 1:10.2.5-4.el7 rhel-7-server-rpms 2.4 M\\n qemu-img x86_64 10:1.5.3-175.el7_9.4 rhel-7-server-rpms 705 k\\n qemu-kvm-common x86_64 10:1.5.3-175.el7_9.4 rhel-7-server-rpms 440 k\\n\\nTransaction Summary\\n================================================================================\\nInstall 2 Packages (+5 Dependent packages)\\n\\nTotal download size: 7.3 M\\nInstalled size: 22 M\\nDownloading packages:\\n'], 'rc': 1, 'invocation': {'module_args': {'lock_timeout': 30, 'update_cache': False, 'disable_excludes': 'None', 'exclude': [], 'allow_downgrade': False, 'disable_gpg_check': False, 'conf_file': 'None', 'use_backend': 'auto', 'state': 'present', 'disablerepo': [], 'releasever': 'None', 'skip_broken': False, 'autoremove': False, 'download_dir': 'None', 'enable_plugin': [], 'installroot': '/', 'install_weak_deps': True, 'name': ['@core', '@base', 'yum-plugin-priorities', 'yum-plugin-fastestmirror', 'redhat-lsb', 'sysstat', 'gdb', 'git-all', 'python-configobj', 'gcc-c++', 'libedit', 'openssl098e', 'boost-thread', 'xfsprogs', 'xfsprogs-devel', 'gdisk', 'parted', 'libgcrypt', 'fuse', 'fuse-libs', 'lvm2', 'openssl', 'libuuid', 'btrfs-progs', 'attr', 'valgrind', 'python-nose', 'mpich', 'ant', 'lsof', 'iozone', 'libtool', 'automake', 'gettext', 'libuuid-devel', 'libacl-devel', 'bc', 'xfsdump', 'blktrace', 'numpy', 'python-matplotlib', 'qemu-kvm', 'usbredir', 'genisoimage', 'httpd', 'httpd-devel', 'httpd-tools', 'mod_ssl', 'mod_fastcgi-2.4.7-1.ceph.el7', 'libev-devel', 'perl-XML-Twig', 'java-1.6.0-openjdk-devel', 'junit4', 'nfs-utils', 'ncurses-devel', 'python-devel', 'python-virtualenv', 'perl-CPAN', 'podman', 'python3'], 'download_only': False, 'bugfix': False, 'list': 'None', 'install_repoquery': True, 'update_only': False, 'disable_plugin': [], 'enablerepo': [], 'security': False, 'validate_certs': True}}, 'changes': {'installed': ['qemu-kvm', 'mod_fastcgi-2.4.7-1.ceph.el7']}, 'msg': "http://gitbuilder.ceph.com/mod_fastcgi-rpm-rhel7-x86_64-basic/ref/master/repodata/repomd.xml: [Errno 14] HTTP Error 403 - Forbidden\nTrying other mirror.\nTo address this issue please refer to the below knowledge base article\n\nhttps://access.redhat.com/solutions/69319\n\nIf above article doesn't help to resolve this issue please open a ticket with Red Hat Support.\n\nhttp://gitbuilder.ceph.com/mod_fastcgi-rpm-rhel7-x86_64-basic/ref/master/x86_64/mod_fastcgi-2.4.7-1.ceph.el7.x86_64.rpm: [Errno 14] HTTP Error 403 - Forbidden\nTrying other mirror.\n\n\nError downloading packages:\n mod_fastcgi-2.4.7-1.ceph.el7.x86_64: [Errno 256] No more mirrors to try.\n\n", '_ansible_no_log': False}}, 'Traceback (most recent call last)': 'File "/home/teuthworker/src/git.ceph.com_git_ceph-cm-ansible_master/callback_plugins/failure_log.py", line 44, in log_failure log.error(yaml.safe_dump(failure)) File "/home/teuthworker/src/git.ceph.com_git_teuthology_b6f3efab84b70e18e86ec271a07564aeb4ed3bac/virtualenv/lib/python3.6/site-packages/yaml/__init__.py", line 306, in safe_dump return dump_all([data], stream, Dumper=SafeDumper, **kwds) File "/home/teuthworker/src/git.ceph.com_git_teuthology_b6f3efab84b70e18e86ec271a07564aeb4ed3bac/virtualenv/lib/python3.6/site-packages/yaml/__init__.py", line 278, in dump_all dumper.represent(data) File "/home/teuthworker/src/git.ceph.com_git_teuthology_b6f3efab84b70e18e86ec271a07564aeb4ed3bac/virtualenv/lib/python3.6/site-packages/yaml/representer.py", line 27, in represent node = self.represent_data(data) File "/home/teuthworker/src/git.ceph.com_git_teuthology_b6f3efab84b70e18e86ec271a07564aeb4ed3bac/virtualenv/lib/python3.6/site-packages/yaml/representer.py", line 48, in represent_data node = self.yaml_representers[data_types[0]](self, data) File "/home/teuthworker/src/git.ceph.com_git_teuthology_b6f3efab84b70e18e86ec271a07564aeb4ed3bac/virtualenv/lib/python3.6/site-packages/yaml/representer.py", line 207, in represent_dict return self.represent_mapping(\'tag:yaml.org,2002:map\', data) File "/home/teuthworker/src/git.ceph.com_git_teuthology_b6f3efab84b70e18e86ec271a07564aeb4ed3bac/virtualenv/lib/python3.6/site-packages/yaml/representer.py", line 118, in represent_mapping node_value = self.represent_data(item_value) File "/home/teuthworker/src/git.ceph.com_git_teuthology_b6f3efab84b70e18e86ec271a07564aeb4ed3bac/virtualenv/lib/python3.6/site-packages/yaml/representer.py", line 48, in represent_data node = self.yaml_representers[data_types[0]](self, data) File "/home/teuthworker/src/git.ceph.com_git_teuthology_b6f3efab84b70e18e86ec271a07564aeb4ed3bac/virtualenv/lib/python3.6/site-packages/yaml/representer.py", line 207, in represent_dict return self.represent_mapping(\'tag:yaml.org,2002:map\', data) File "/home/teuthworker/src/git.ceph.com_git_teuthology_b6f3efab84b70e18e86ec271a07564aeb4ed3bac/virtualenv/lib/python3.6/site-packages/yaml/representer.py", line 117, in represent_mapping node_key = self.represent_data(item_key) File "/home/teuthworker/src/git.ceph.com_git_teuthology_b6f3efab84b70e18e86ec271a07564aeb4ed3bac/virtualenv/lib/python3.6/site-packages/yaml/representer.py", line 58, in represent_data node = self.yaml_representers[None](self, data) File "/home/teuthworker/src/git.ceph.com_git_teuthology_b6f3efab84b70e18e86ec271a07564aeb4ed3bac/virtualenv/lib/python3.6/site-packages/yaml/representer.py", line 231, in represent_undefined raise RepresenterError("cannot represent an object", data)', 'yaml.representer.RepresenterError': "('cannot represent an object', 'changed')"}

dead 6288633 2021-07-23 13:25:57 2021-07-28 16:48:31 2021-07-28 17:14:31 0:26:00 0:08:04 0:17:56 gibba master rhel 7.9 kcephfs/recovery/{begin clusters/1-mds-4-client conf/{client mds mon osd} kclient/{mount overrides/{distro/rhel/{k-distro rhel_latest} ms-die-on-skipped}} objectstore-ec/bluestore-comp-ec-root overrides/{frag_enable log-config osd-asserts whitelist_health whitelist_wrongly_marked_down} tasks/mds-full} 6
Failure Reason:

{'Failure object was': {'gibba037.front.sepia.ceph.com': {'changed': False, 'results': ['yum-plugin-priorities-1.1.31-54.el7_8.noarch providing yum-plugin-priorities is already installed', 'yum-plugin-fastestmirror-1.1.31-54.el7_8.noarch providing yum-plugin-fastestmirror is already installed', 'redhat-lsb-4.1-27.el7.x86_64 providing redhat-lsb is already installed', 'sysstat-10.1.5-19.el7.x86_64 providing sysstat is already installed', 'gdb-7.6.1-120.el7.x86_64 providing gdb is already installed', 'git-all-1.8.3.1-23.el7_8.noarch providing git-all is already installed', 'python-configobj-4.7.2-7.el7.noarch providing python-configobj is already installed', 'gcc-c++-4.8.5-44.el7.x86_64 providing gcc-c++ is already installed', 'libedit-3.0-12.20121213cvs.el7.x86_64 providing libedit is already installed', 'openssl098e-0.9.8e-29.el7_2.3.x86_64 providing openssl098e is already installed', 'boost-thread-1.53.0-28.el7.x86_64 providing boost-thread is already installed', 'xfsprogs-4.5.0-22.el7.x86_64 providing xfsprogs is already installed', 'xfsprogs-devel-4.5.0-22.el7.x86_64 providing xfsprogs-devel is already installed', 'gdisk-0.8.10-3.el7.x86_64 providing gdisk is already installed', 'parted-3.1-32.el7.x86_64 providing parted is already installed', 'libgcrypt-1.5.3-14.el7.x86_64 providing libgcrypt is already installed', 'fuse-2.9.2-11.el7.x86_64 providing fuse is already installed', 'fuse-libs-2.9.2-11.el7.x86_64 providing fuse-libs is already installed', '7:lvm2-2.02.187-6.el7.x86_64 providing lvm2 is already installed', '1:openssl-1.0.2k-19.el7.x86_64 providing openssl is already installed', 'libuuid-2.23.2-65.el7_9.1.x86_64 providing libuuid is already installed', 'btrfs-progs-4.9.1-1.el7.x86_64 providing btrfs-progs is already installed', 'attr-2.4.46-13.el7.x86_64 providing attr is already installed', '1:valgrind-3.15.0-11.el7.x86_64 providing valgrind is already installed', 'python-nose-1.3.7-1.el7.noarch providing python-nose is already installed', 'mpich-3.0-3.0.4-10.el7.x86_64 providing mpich is already installed', 'ant-1.9.4-2.el7.noarch providing ant is already installed', 'lsof-4.87-6.el7.x86_64 providing lsof is already installed', 'iozone-3.424-2_ceph.el7.x86_64 providing iozone is already installed', 'libtool-2.4.2-22.el7_3.x86_64 providing libtool is already installed', 'automake-1.13.4-3.el7.noarch providing automake is already installed', 'gettext-0.19.8.1-3.el7.x86_64 providing gettext is already installed', 'libuuid-devel-2.23.2-65.el7_9.1.x86_64 providing libuuid-devel is already installed', 'libacl-devel-2.2.51-15.el7.x86_64 providing libacl-devel is already installed', 'bc-1.06.95-13.el7.x86_64 providing bc is already installed', 'xfsdump-3.1.7-1.el7.x86_64 providing xfsdump is already installed', 'blktrace-1.0.5-9.el7.x86_64 providing blktrace is already installed', '1:numpy-1.7.1-13.el7.x86_64 providing numpy is already installed', 'python-matplotlib-1.2.0-16.el7.x86_64 providing python-matplotlib is already installed', 'usbredir-0.7.1-3.el7.x86_64 providing usbredir is already installed', 'genisoimage-1.1.11-25.el7.x86_64 providing genisoimage is already installed', 'httpd-2.4.6-97.el7_9.x86_64 providing httpd is already installed', 'httpd-devel-2.4.6-97.el7_9.x86_64 providing httpd-devel is already installed', 'httpd-tools-2.4.6-97.el7_9.x86_64 providing httpd-tools is already installed', '1:mod_ssl-2.4.6-97.el7_9.x86_64 providing mod_ssl is already installed', 'libev-devel-4.15-7.el7.x86_64 providing libev-devel is already installed', 'perl-XML-Twig-3.44-2.el7.noarch providing perl-XML-Twig is already installed', '1:java-1.6.0-openjdk-devel-1.6.0.41-1.13.13.1.el7_3.x86_64 providing java-1.6.0-openjdk-devel is already installed', 'junit-4.11-8.el7.noarch providing junit4 is already installed', '1:nfs-utils-1.3.0-0.68.el7.x86_64 providing nfs-utils is already installed', 'ncurses-devel-5.9-14.20130511.el7_4.x86_64 providing ncurses-devel is already installed', 'python-devel-2.7.5-90.el7.x86_64 providing python-devel is already installed', 'python-virtualenv-15.1.0-4.el7_8.noarch providing python-virtualenv is already installed', 'perl-CPAN-1.9800-299.el7_9.noarch providing perl-CPAN is already installed', 'podman-1.6.4-29.el7_9.x86_64 providing podman is already installed', 'python3-3.6.8-18.el7.x86_64 providing python3 is already installed', 'Loaded plugins: fastestmirror, langpacks, priorities, product-id, search-\\n : disabled-repos, subscription-manager\\nLoading mirror speeds from cached hostfile\\n * epel: download-cc-rdu01.fedoraproject.org\\nResolving Dependencies\\n--> Running transaction check\\n---> Package mod_fastcgi.x86_64 0:2.4.7-1.ceph.el7 will be installed\\n---> Package qemu-kvm.x86_64 10:1.5.3-175.el7_9.4 will be installed\\n--> Processing Dependency: qemu-kvm-common = 10:1.5.3-175.el7_9.4 for package: 10:qemu-kvm-1.5.3-175.el7_9.4.x86_64\\n--> Processing Dependency: qemu-img = 10:1.5.3-175.el7_9.4 for package: 10:qemu-kvm-1.5.3-175.el7_9.4.x86_64\\n--> Processing Dependency: librbd.so.1()(64bit) for package: 10:qemu-kvm-1.5.3-175.el7_9.4.x86_64\\n--> Processing Dependency: librados.so.2()(64bit) for package: 10:qemu-kvm-1.5.3-175.el7_9.4.x86_64\\n--> Running transaction check\\n---> Package librados2.x86_64 1:10.2.5-4.el7 will be installed\\n--> Processing Dependency: libboost_random-mt.so.1.53.0()(64bit) for package: 1:librados2-10.2.5-4.el7.x86_64\\n---> Package librbd1.x86_64 1:10.2.5-4.el7 will be installed\\n---> Package qemu-img.x86_64 10:1.5.3-175.el7_9.4 will be installed\\n---> Package qemu-kvm-common.x86_64 10:1.5.3-175.el7_9.4 will be installed\\n--> Running transaction check\\n---> Package boost-random.x86_64 0:1.53.0-28.el7 will be installed\\n--> Finished Dependency Resolution\\n\\nDependencies Resolved\\n\\n================================================================================\\n Package Arch Version Repository Size\\n================================================================================\\nInstalling:\\n mod_fastcgi x86_64 2.4.7-1.ceph.el7 rhel-7-fcgi-ceph 70 k\\n qemu-kvm x86_64 10:1.5.3-175.el7_9.4 rhel-7-server-rpms 1.9 M\\nInstalling for dependencies:\\n boost-random x86_64 1.53.0-28.el7 rhel-7-server-rpms 39 k\\n librados2 x86_64 1:10.2.5-4.el7 rhel-7-server-rpms 1.8 M\\n librbd1 x86_64 1:10.2.5-4.el7 rhel-7-server-rpms 2.4 M\\n qemu-img x86_64 10:1.5.3-175.el7_9.4 rhel-7-server-rpms 705 k\\n qemu-kvm-common x86_64 10:1.5.3-175.el7_9.4 rhel-7-server-rpms 440 k\\n\\nTransaction Summary\\n================================================================================\\nInstall 2 Packages (+5 Dependent packages)\\n\\nTotal download size: 7.3 M\\nInstalled size: 22 M\\nDownloading packages:\\n'], 'rc': 1, 'invocation': {'module_args': {'lock_timeout': 30, 'update_cache': False, 'disable_excludes': 'None', 'exclude': [], 'allow_downgrade': False, 'disable_gpg_check': False, 'conf_file': 'None', 'use_backend': 'auto', 'state': 'present', 'disablerepo': [], 'releasever': 'None', 'skip_broken': False, 'autoremove': False, 'download_dir': 'None', 'enable_plugin': [], 'installroot': '/', 'install_weak_deps': True, 'name': ['@core', '@base', 'yum-plugin-priorities', 'yum-plugin-fastestmirror', 'redhat-lsb', 'sysstat', 'gdb', 'git-all', 'python-configobj', 'gcc-c++', 'libedit', 'openssl098e', 'boost-thread', 'xfsprogs', 'xfsprogs-devel', 'gdisk', 'parted', 'libgcrypt', 'fuse', 'fuse-libs', 'lvm2', 'openssl', 'libuuid', 'btrfs-progs', 'attr', 'valgrind', 'python-nose', 'mpich', 'ant', 'lsof', 'iozone', 'libtool', 'automake', 'gettext', 'libuuid-devel', 'libacl-devel', 'bc', 'xfsdump', 'blktrace', 'numpy', 'python-matplotlib', 'qemu-kvm', 'usbredir', 'genisoimage', 'httpd', 'httpd-devel', 'httpd-tools', 'mod_ssl', 'mod_fastcgi-2.4.7-1.ceph.el7', 'libev-devel', 'perl-XML-Twig', 'java-1.6.0-openjdk-devel', 'junit4', 'nfs-utils', 'ncurses-devel', 'python-devel', 'python-virtualenv', 'perl-CPAN', 'podman', 'python3'], 'download_only': False, 'bugfix': False, 'list': 'None', 'install_repoquery': True, 'update_only': False, 'disable_plugin': [], 'enablerepo': [], 'security': False, 'validate_certs': True}}, 'changes': {'installed': ['qemu-kvm', 'mod_fastcgi-2.4.7-1.ceph.el7']}, 'msg': "http://gitbuilder.ceph.com/mod_fastcgi-rpm-rhel7-x86_64-basic/ref/master/repodata/repomd.xml: [Errno 14] HTTP Error 403 - Forbidden\nTrying other mirror.\nTo address this issue please refer to the below knowledge base article\n\nhttps://access.redhat.com/solutions/69319\n\nIf above article doesn't help to resolve this issue please open a ticket with Red Hat Support.\n\nhttp://gitbuilder.ceph.com/mod_fastcgi-rpm-rhel7-x86_64-basic/ref/master/x86_64/mod_fastcgi-2.4.7-1.ceph.el7.x86_64.rpm: [Errno 14] HTTP Error 403 - Forbidden\nTrying other mirror.\n\n\nError downloading packages:\n mod_fastcgi-2.4.7-1.ceph.el7.x86_64: [Errno 256] No more mirrors to try.\n\n", '_ansible_no_log': False}}, 'Traceback (most recent call last)': 'File "/home/teuthworker/src/git.ceph.com_git_ceph-cm-ansible_master/callback_plugins/failure_log.py", line 44, in log_failure log.error(yaml.safe_dump(failure)) File "/home/teuthworker/src/git.ceph.com_git_teuthology_b6f3efab84b70e18e86ec271a07564aeb4ed3bac/virtualenv/lib/python3.6/site-packages/yaml/__init__.py", line 306, in safe_dump return dump_all([data], stream, Dumper=SafeDumper, **kwds) File "/home/teuthworker/src/git.ceph.com_git_teuthology_b6f3efab84b70e18e86ec271a07564aeb4ed3bac/virtualenv/lib/python3.6/site-packages/yaml/__init__.py", line 278, in dump_all dumper.represent(data) File "/home/teuthworker/src/git.ceph.com_git_teuthology_b6f3efab84b70e18e86ec271a07564aeb4ed3bac/virtualenv/lib/python3.6/site-packages/yaml/representer.py", line 27, in represent node = self.represent_data(data) File "/home/teuthworker/src/git.ceph.com_git_teuthology_b6f3efab84b70e18e86ec271a07564aeb4ed3bac/virtualenv/lib/python3.6/site-packages/yaml/representer.py", line 48, in represent_data node = self.yaml_representers[data_types[0]](self, data) File "/home/teuthworker/src/git.ceph.com_git_teuthology_b6f3efab84b70e18e86ec271a07564aeb4ed3bac/virtualenv/lib/python3.6/site-packages/yaml/representer.py", line 207, in represent_dict return self.represent_mapping(\'tag:yaml.org,2002:map\', data) File "/home/teuthworker/src/git.ceph.com_git_teuthology_b6f3efab84b70e18e86ec271a07564aeb4ed3bac/virtualenv/lib/python3.6/site-packages/yaml/representer.py", line 118, in represent_mapping node_value = self.represent_data(item_value) File "/home/teuthworker/src/git.ceph.com_git_teuthology_b6f3efab84b70e18e86ec271a07564aeb4ed3bac/virtualenv/lib/python3.6/site-packages/yaml/representer.py", line 48, in represent_data node = self.yaml_representers[data_types[0]](self, data) File "/home/teuthworker/src/git.ceph.com_git_teuthology_b6f3efab84b70e18e86ec271a07564aeb4ed3bac/virtualenv/lib/python3.6/site-packages/yaml/representer.py", line 207, in represent_dict return self.represent_mapping(\'tag:yaml.org,2002:map\', data) File "/home/teuthworker/src/git.ceph.com_git_teuthology_b6f3efab84b70e18e86ec271a07564aeb4ed3bac/virtualenv/lib/python3.6/site-packages/yaml/representer.py", line 117, in represent_mapping node_key = self.represent_data(item_key) File "/home/teuthworker/src/git.ceph.com_git_teuthology_b6f3efab84b70e18e86ec271a07564aeb4ed3bac/virtualenv/lib/python3.6/site-packages/yaml/representer.py", line 58, in represent_data node = self.yaml_representers[None](self, data) File "/home/teuthworker/src/git.ceph.com_git_teuthology_b6f3efab84b70e18e86ec271a07564aeb4ed3bac/virtualenv/lib/python3.6/site-packages/yaml/representer.py", line 231, in represent_undefined raise RepresenterError("cannot represent an object", data)', 'yaml.representer.RepresenterError': "('cannot represent an object', 'changed')"}

dead 6288630 2021-07-23 13:25:55 2021-07-28 16:33:07 2021-07-28 16:59:19 0:26:12 0:06:04 0:20:08 gibba master rhel 7.9 kcephfs/thrash/{begin clusters/1-mds-1-client conf/{client mds mon osd} kclient/{mount overrides/{distro/rhel/{k-distro rhel_latest} ms-die-on-skipped}} objectstore-ec/bluestore-bitmap overrides/{frag_enable log-config osd-asserts thrash-health-whitelist whitelist_health whitelist_wrongly_marked_down} thrashers/mds workloads/kclient_workunit_suites_ffsb} 3
Failure Reason:

{'Failure object was': {'gibba004.front.sepia.ceph.com': {'changed': False, 'results': ['yum-plugin-priorities-1.1.31-54.el7_8.noarch providing yum-plugin-priorities is already installed', 'yum-plugin-fastestmirror-1.1.31-54.el7_8.noarch providing yum-plugin-fastestmirror is already installed', 'redhat-lsb-4.1-27.el7.x86_64 providing redhat-lsb is already installed', 'sysstat-10.1.5-19.el7.x86_64 providing sysstat is already installed', 'gdb-7.6.1-120.el7.x86_64 providing gdb is already installed', 'git-all-1.8.3.1-23.el7_8.noarch providing git-all is already installed', 'python-configobj-4.7.2-7.el7.noarch providing python-configobj is already installed', 'gcc-c++-4.8.5-44.el7.x86_64 providing gcc-c++ is already installed', 'libedit-3.0-12.20121213cvs.el7.x86_64 providing libedit is already installed', 'openssl098e-0.9.8e-29.el7_2.3.x86_64 providing openssl098e is already installed', 'boost-thread-1.53.0-28.el7.x86_64 providing boost-thread is already installed', 'xfsprogs-4.5.0-22.el7.x86_64 providing xfsprogs is already installed', 'xfsprogs-devel-4.5.0-22.el7.x86_64 providing xfsprogs-devel is already installed', 'gdisk-0.8.10-3.el7.x86_64 providing gdisk is already installed', 'parted-3.1-32.el7.x86_64 providing parted is already installed', 'libgcrypt-1.5.3-14.el7.x86_64 providing libgcrypt is already installed', 'fuse-2.9.2-11.el7.x86_64 providing fuse is already installed', 'fuse-libs-2.9.2-11.el7.x86_64 providing fuse-libs is already installed', '7:lvm2-2.02.187-6.el7.x86_64 providing lvm2 is already installed', '1:openssl-1.0.2k-19.el7.x86_64 providing openssl is already installed', 'libuuid-2.23.2-65.el7_9.1.x86_64 providing libuuid is already installed', 'btrfs-progs-4.9.1-1.el7.x86_64 providing btrfs-progs is already installed', 'attr-2.4.46-13.el7.x86_64 providing attr is already installed', '1:valgrind-3.15.0-11.el7.x86_64 providing valgrind is already installed', 'python-nose-1.3.7-1.el7.noarch providing python-nose is already installed', 'mpich-3.0-3.0.4-10.el7.x86_64 providing mpich is already installed', 'ant-1.9.4-2.el7.noarch providing ant is already installed', 'lsof-4.87-6.el7.x86_64 providing lsof is already installed', 'iozone-3.424-2_ceph.el7.x86_64 providing iozone is already installed', 'libtool-2.4.2-22.el7_3.x86_64 providing libtool is already installed', 'automake-1.13.4-3.el7.noarch providing automake is already installed', 'gettext-0.19.8.1-3.el7.x86_64 providing gettext is already installed', 'libuuid-devel-2.23.2-65.el7_9.1.x86_64 providing libuuid-devel is already installed', 'libacl-devel-2.2.51-15.el7.x86_64 providing libacl-devel is already installed', 'bc-1.06.95-13.el7.x86_64 providing bc is already installed', 'xfsdump-3.1.7-1.el7.x86_64 providing xfsdump is already installed', 'blktrace-1.0.5-9.el7.x86_64 providing blktrace is already installed', '1:numpy-1.7.1-13.el7.x86_64 providing numpy is already installed', 'python-matplotlib-1.2.0-16.el7.x86_64 providing python-matplotlib is already installed', 'usbredir-0.7.1-3.el7.x86_64 providing usbredir is already installed', 'genisoimage-1.1.11-25.el7.x86_64 providing genisoimage is already installed', 'httpd-2.4.6-97.el7_9.x86_64 providing httpd is already installed', 'httpd-devel-2.4.6-97.el7_9.x86_64 providing httpd-devel is already installed', 'httpd-tools-2.4.6-97.el7_9.x86_64 providing httpd-tools is already installed', '1:mod_ssl-2.4.6-97.el7_9.x86_64 providing mod_ssl is already installed', 'libev-devel-4.15-7.el7.x86_64 providing libev-devel is already installed', 'perl-XML-Twig-3.44-2.el7.noarch providing perl-XML-Twig is already installed', '1:java-1.6.0-openjdk-devel-1.6.0.41-1.13.13.1.el7_3.x86_64 providing java-1.6.0-openjdk-devel is already installed', 'junit-4.11-8.el7.noarch providing junit4 is already installed', '1:nfs-utils-1.3.0-0.68.el7.x86_64 providing nfs-utils is already installed', 'ncurses-devel-5.9-14.20130511.el7_4.x86_64 providing ncurses-devel is already installed', 'python-devel-2.7.5-90.el7.x86_64 providing python-devel is already installed', 'python-virtualenv-15.1.0-4.el7_8.noarch providing python-virtualenv is already installed', 'perl-CPAN-1.9800-299.el7_9.noarch providing perl-CPAN is already installed', 'podman-1.6.4-29.el7_9.x86_64 providing podman is already installed', 'python3-3.6.8-18.el7.x86_64 providing python3 is already installed', 'Loaded plugins: fastestmirror, langpacks, priorities, product-id, search-\\n : disabled-repos, subscription-manager\\nLoading mirror speeds from cached hostfile\\n * epel: ftp.linux.ncsu.edu\\nResolving Dependencies\\n--> Running transaction check\\n---> Package mod_fastcgi.x86_64 0:2.4.7-1.ceph.el7 will be installed\\n---> Package qemu-kvm.x86_64 10:1.5.3-175.el7_9.4 will be installed\\n--> Processing Dependency: qemu-kvm-common = 10:1.5.3-175.el7_9.4 for package: 10:qemu-kvm-1.5.3-175.el7_9.4.x86_64\\n--> Processing Dependency: qemu-img = 10:1.5.3-175.el7_9.4 for package: 10:qemu-kvm-1.5.3-175.el7_9.4.x86_64\\n--> Processing Dependency: librbd.so.1()(64bit) for package: 10:qemu-kvm-1.5.3-175.el7_9.4.x86_64\\n--> Processing Dependency: librados.so.2()(64bit) for package: 10:qemu-kvm-1.5.3-175.el7_9.4.x86_64\\n--> Running transaction check\\n---> Package librados2.x86_64 1:10.2.5-4.el7 will be installed\\n--> Processing Dependency: libboost_random-mt.so.1.53.0()(64bit) for package: 1:librados2-10.2.5-4.el7.x86_64\\n---> Package librbd1.x86_64 1:10.2.5-4.el7 will be installed\\n---> Package qemu-img.x86_64 10:1.5.3-175.el7_9.4 will be installed\\n---> Package qemu-kvm-common.x86_64 10:1.5.3-175.el7_9.4 will be installed\\n--> Running transaction check\\n---> Package boost-random.x86_64 0:1.53.0-28.el7 will be installed\\n--> Finished Dependency Resolution\\n\\nDependencies Resolved\\n\\n================================================================================\\n Package Arch Version Repository Size\\n================================================================================\\nInstalling:\\n mod_fastcgi x86_64 2.4.7-1.ceph.el7 rhel-7-fcgi-ceph 70 k\\n qemu-kvm x86_64 10:1.5.3-175.el7_9.4 rhel-7-server-rpms 1.9 M\\nInstalling for dependencies:\\n boost-random x86_64 1.53.0-28.el7 rhel-7-server-rpms 39 k\\n librados2 x86_64 1:10.2.5-4.el7 rhel-7-server-rpms 1.8 M\\n librbd1 x86_64 1:10.2.5-4.el7 rhel-7-server-rpms 2.4 M\\n qemu-img x86_64 10:1.5.3-175.el7_9.4 rhel-7-server-rpms 705 k\\n qemu-kvm-common x86_64 10:1.5.3-175.el7_9.4 rhel-7-server-rpms 440 k\\n\\nTransaction Summary\\n================================================================================\\nInstall 2 Packages (+5 Dependent packages)\\n\\nTotal download size: 7.3 M\\nInstalled size: 22 M\\nDownloading packages:\\n'], 'rc': 1, 'invocation': {'module_args': {'lock_timeout': 30, 'update_cache': False, 'disable_excludes': 'None', 'exclude': [], 'allow_downgrade': False, 'disable_gpg_check': False, 'conf_file': 'None', 'use_backend': 'auto', 'state': 'present', 'disablerepo': [], 'releasever': 'None', 'skip_broken': False, 'autoremove': False, 'download_dir': 'None', 'enable_plugin': [], 'installroot': '/', 'install_weak_deps': True, 'name': ['@core', '@base', 'yum-plugin-priorities', 'yum-plugin-fastestmirror', 'redhat-lsb', 'sysstat', 'gdb', 'git-all', 'python-configobj', 'gcc-c++', 'libedit', 'openssl098e', 'boost-thread', 'xfsprogs', 'xfsprogs-devel', 'gdisk', 'parted', 'libgcrypt', 'fuse', 'fuse-libs', 'lvm2', 'openssl', 'libuuid', 'btrfs-progs', 'attr', 'valgrind', 'python-nose', 'mpich', 'ant', 'lsof', 'iozone', 'libtool', 'automake', 'gettext', 'libuuid-devel', 'libacl-devel', 'bc', 'xfsdump', 'blktrace', 'numpy', 'python-matplotlib', 'qemu-kvm', 'usbredir', 'genisoimage', 'httpd', 'httpd-devel', 'httpd-tools', 'mod_ssl', 'mod_fastcgi-2.4.7-1.ceph.el7', 'libev-devel', 'perl-XML-Twig', 'java-1.6.0-openjdk-devel', 'junit4', 'nfs-utils', 'ncurses-devel', 'python-devel', 'python-virtualenv', 'perl-CPAN', 'podman', 'python3'], 'download_only': False, 'bugfix': False, 'list': 'None', 'install_repoquery': True, 'update_only': False, 'disable_plugin': [], 'enablerepo': [], 'security': False, 'validate_certs': True}}, 'changes': {'installed': ['qemu-kvm', 'mod_fastcgi-2.4.7-1.ceph.el7']}, 'msg': "http://gitbuilder.ceph.com/mod_fastcgi-rpm-rhel7-x86_64-basic/ref/master/repodata/repomd.xml: [Errno 14] HTTP Error 403 - Forbidden\nTrying other mirror.\nTo address this issue please refer to the below knowledge base article\n\nhttps://access.redhat.com/solutions/69319\n\nIf above article doesn't help to resolve this issue please open a ticket with Red Hat Support.\n\nhttp://gitbuilder.ceph.com/mod_fastcgi-rpm-rhel7-x86_64-basic/ref/master/x86_64/mod_fastcgi-2.4.7-1.ceph.el7.x86_64.rpm: [Errno 14] HTTP Error 403 - Forbidden\nTrying other mirror.\n\n\nError downloading packages:\n mod_fastcgi-2.4.7-1.ceph.el7.x86_64: [Errno 256] No more mirrors to try.\n\n", '_ansible_no_log': False}}, 'Traceback (most recent call last)': 'File "/home/teuthworker/src/git.ceph.com_git_ceph-cm-ansible_master/callback_plugins/failure_log.py", line 44, in log_failure log.error(yaml.safe_dump(failure)) File "/home/teuthworker/src/git.ceph.com_git_teuthology_b6f3efab84b70e18e86ec271a07564aeb4ed3bac/virtualenv/lib/python3.6/site-packages/yaml/__init__.py", line 306, in safe_dump return dump_all([data], stream, Dumper=SafeDumper, **kwds) File "/home/teuthworker/src/git.ceph.com_git_teuthology_b6f3efab84b70e18e86ec271a07564aeb4ed3bac/virtualenv/lib/python3.6/site-packages/yaml/__init__.py", line 278, in dump_all dumper.represent(data) File "/home/teuthworker/src/git.ceph.com_git_teuthology_b6f3efab84b70e18e86ec271a07564aeb4ed3bac/virtualenv/lib/python3.6/site-packages/yaml/representer.py", line 27, in represent node = self.represent_data(data) File "/home/teuthworker/src/git.ceph.com_git_teuthology_b6f3efab84b70e18e86ec271a07564aeb4ed3bac/virtualenv/lib/python3.6/site-packages/yaml/representer.py", line 48, in represent_data node = self.yaml_representers[data_types[0]](self, data) File "/home/teuthworker/src/git.ceph.com_git_teuthology_b6f3efab84b70e18e86ec271a07564aeb4ed3bac/virtualenv/lib/python3.6/site-packages/yaml/representer.py", line 207, in represent_dict return self.represent_mapping(\'tag:yaml.org,2002:map\', data) File "/home/teuthworker/src/git.ceph.com_git_teuthology_b6f3efab84b70e18e86ec271a07564aeb4ed3bac/virtualenv/lib/python3.6/site-packages/yaml/representer.py", line 118, in represent_mapping node_value = self.represent_data(item_value) File "/home/teuthworker/src/git.ceph.com_git_teuthology_b6f3efab84b70e18e86ec271a07564aeb4ed3bac/virtualenv/lib/python3.6/site-packages/yaml/representer.py", line 48, in represent_data node = self.yaml_representers[data_types[0]](self, data) File "/home/teuthworker/src/git.ceph.com_git_teuthology_b6f3efab84b70e18e86ec271a07564aeb4ed3bac/virtualenv/lib/python3.6/site-packages/yaml/representer.py", line 207, in represent_dict return self.represent_mapping(\'tag:yaml.org,2002:map\', data) File "/home/teuthworker/src/git.ceph.com_git_teuthology_b6f3efab84b70e18e86ec271a07564aeb4ed3bac/virtualenv/lib/python3.6/site-packages/yaml/representer.py", line 117, in represent_mapping node_key = self.represent_data(item_key) File "/home/teuthworker/src/git.ceph.com_git_teuthology_b6f3efab84b70e18e86ec271a07564aeb4ed3bac/virtualenv/lib/python3.6/site-packages/yaml/representer.py", line 58, in represent_data node = self.yaml_representers[None](self, data) File "/home/teuthworker/src/git.ceph.com_git_teuthology_b6f3efab84b70e18e86ec271a07564aeb4ed3bac/virtualenv/lib/python3.6/site-packages/yaml/representer.py", line 231, in represent_undefined raise RepresenterError("cannot represent an object", data)', 'yaml.representer.RepresenterError': "('cannot represent an object', 'changed')"}

dead 6288627 2021-07-23 13:25:53 2021-07-28 16:33:06 2021-07-28 16:46:09 0:13:03 0:06:07 0:06:56 gibba master rhel 7.9 kcephfs/cephfs/{begin clusters/1-mds-1-client conf/{client mds mon osd} inline/no kclient/{mount overrides/{distro/rhel/{k-distro rhel_latest} ms-die-on-skipped}} objectstore-ec/bluestore-bitmap overrides/{frag_enable log-config osd-asserts whitelist_health whitelist_wrongly_marked_down} tasks/kclient_workunit_kernel_untar_build} 3
Failure Reason:

{'Failure object was': {'gibba004.front.sepia.ceph.com': {'changed': False, 'results': ['yum-plugin-priorities-1.1.31-54.el7_8.noarch providing yum-plugin-priorities is already installed', 'yum-plugin-fastestmirror-1.1.31-54.el7_8.noarch providing yum-plugin-fastestmirror is already installed', 'redhat-lsb-4.1-27.el7.x86_64 providing redhat-lsb is already installed', 'sysstat-10.1.5-19.el7.x86_64 providing sysstat is already installed', 'gdb-7.6.1-120.el7.x86_64 providing gdb is already installed', 'git-all-1.8.3.1-23.el7_8.noarch providing git-all is already installed', 'python-configobj-4.7.2-7.el7.noarch providing python-configobj is already installed', 'gcc-c++-4.8.5-44.el7.x86_64 providing gcc-c++ is already installed', 'libedit-3.0-12.20121213cvs.el7.x86_64 providing libedit is already installed', 'openssl098e-0.9.8e-29.el7_2.3.x86_64 providing openssl098e is already installed', 'boost-thread-1.53.0-28.el7.x86_64 providing boost-thread is already installed', 'xfsprogs-4.5.0-22.el7.x86_64 providing xfsprogs is already installed', 'xfsprogs-devel-4.5.0-22.el7.x86_64 providing xfsprogs-devel is already installed', 'gdisk-0.8.10-3.el7.x86_64 providing gdisk is already installed', 'parted-3.1-32.el7.x86_64 providing parted is already installed', 'libgcrypt-1.5.3-14.el7.x86_64 providing libgcrypt is already installed', 'fuse-2.9.2-11.el7.x86_64 providing fuse is already installed', 'fuse-libs-2.9.2-11.el7.x86_64 providing fuse-libs is already installed', '7:lvm2-2.02.187-6.el7.x86_64 providing lvm2 is already installed', '1:openssl-1.0.2k-19.el7.x86_64 providing openssl is already installed', 'libuuid-2.23.2-65.el7_9.1.x86_64 providing libuuid is already installed', 'btrfs-progs-4.9.1-1.el7.x86_64 providing btrfs-progs is already installed', 'attr-2.4.46-13.el7.x86_64 providing attr is already installed', '1:valgrind-3.15.0-11.el7.x86_64 providing valgrind is already installed', 'python-nose-1.3.7-1.el7.noarch providing python-nose is already installed', 'mpich-3.0-3.0.4-10.el7.x86_64 providing mpich is already installed', 'ant-1.9.4-2.el7.noarch providing ant is already installed', 'lsof-4.87-6.el7.x86_64 providing lsof is already installed', 'iozone-3.424-2_ceph.el7.x86_64 providing iozone is already installed', 'libtool-2.4.2-22.el7_3.x86_64 providing libtool is already installed', 'automake-1.13.4-3.el7.noarch providing automake is already installed', 'gettext-0.19.8.1-3.el7.x86_64 providing gettext is already installed', 'libuuid-devel-2.23.2-65.el7_9.1.x86_64 providing libuuid-devel is already installed', 'libacl-devel-2.2.51-15.el7.x86_64 providing libacl-devel is already installed', 'bc-1.06.95-13.el7.x86_64 providing bc is already installed', 'xfsdump-3.1.7-1.el7.x86_64 providing xfsdump is already installed', 'blktrace-1.0.5-9.el7.x86_64 providing blktrace is already installed', '1:numpy-1.7.1-13.el7.x86_64 providing numpy is already installed', 'python-matplotlib-1.2.0-16.el7.x86_64 providing python-matplotlib is already installed', 'usbredir-0.7.1-3.el7.x86_64 providing usbredir is already installed', 'genisoimage-1.1.11-25.el7.x86_64 providing genisoimage is already installed', 'httpd-2.4.6-97.el7_9.x86_64 providing httpd is already installed', 'httpd-devel-2.4.6-97.el7_9.x86_64 providing httpd-devel is already installed', 'httpd-tools-2.4.6-97.el7_9.x86_64 providing httpd-tools is already installed', '1:mod_ssl-2.4.6-97.el7_9.x86_64 providing mod_ssl is already installed', 'libev-devel-4.15-7.el7.x86_64 providing libev-devel is already installed', 'perl-XML-Twig-3.44-2.el7.noarch providing perl-XML-Twig is already installed', '1:java-1.6.0-openjdk-devel-1.6.0.41-1.13.13.1.el7_3.x86_64 providing java-1.6.0-openjdk-devel is already installed', 'junit-4.11-8.el7.noarch providing junit4 is already installed', '1:nfs-utils-1.3.0-0.68.el7.x86_64 providing nfs-utils is already installed', 'ncurses-devel-5.9-14.20130511.el7_4.x86_64 providing ncurses-devel is already installed', 'python-devel-2.7.5-90.el7.x86_64 providing python-devel is already installed', 'python-virtualenv-15.1.0-4.el7_8.noarch providing python-virtualenv is already installed', 'perl-CPAN-1.9800-299.el7_9.noarch providing perl-CPAN is already installed', 'podman-1.6.4-29.el7_9.x86_64 providing podman is already installed', 'python3-3.6.8-18.el7.x86_64 providing python3 is already installed', 'Loaded plugins: fastestmirror, langpacks, priorities, product-id, search-\\n : disabled-repos, subscription-manager\\nLoading mirror speeds from cached hostfile\\n * epel: download-cc-rdu01.fedoraproject.org\\nResolving Dependencies\\n--> Running transaction check\\n---> Package mod_fastcgi.x86_64 0:2.4.7-1.ceph.el7 will be installed\\n---> Package qemu-kvm.x86_64 10:1.5.3-175.el7_9.4 will be installed\\n--> Processing Dependency: qemu-kvm-common = 10:1.5.3-175.el7_9.4 for package: 10:qemu-kvm-1.5.3-175.el7_9.4.x86_64\\n--> Processing Dependency: qemu-img = 10:1.5.3-175.el7_9.4 for package: 10:qemu-kvm-1.5.3-175.el7_9.4.x86_64\\n--> Processing Dependency: librbd.so.1()(64bit) for package: 10:qemu-kvm-1.5.3-175.el7_9.4.x86_64\\n--> Processing Dependency: librados.so.2()(64bit) for package: 10:qemu-kvm-1.5.3-175.el7_9.4.x86_64\\n--> Running transaction check\\n---> Package librados2.x86_64 1:10.2.5-4.el7 will be installed\\n--> Processing Dependency: libboost_random-mt.so.1.53.0()(64bit) for package: 1:librados2-10.2.5-4.el7.x86_64\\n---> Package librbd1.x86_64 1:10.2.5-4.el7 will be installed\\n---> Package qemu-img.x86_64 10:1.5.3-175.el7_9.4 will be installed\\n---> Package qemu-kvm-common.x86_64 10:1.5.3-175.el7_9.4 will be installed\\n--> Running transaction check\\n---> Package boost-random.x86_64 0:1.53.0-28.el7 will be installed\\n--> Finished Dependency Resolution\\n\\nDependencies Resolved\\n\\n================================================================================\\n Package Arch Version Repository Size\\n================================================================================\\nInstalling:\\n mod_fastcgi x86_64 2.4.7-1.ceph.el7 rhel-7-fcgi-ceph 70 k\\n qemu-kvm x86_64 10:1.5.3-175.el7_9.4 rhel-7-server-rpms 1.9 M\\nInstalling for dependencies:\\n boost-random x86_64 1.53.0-28.el7 rhel-7-server-rpms 39 k\\n librados2 x86_64 1:10.2.5-4.el7 rhel-7-server-rpms 1.8 M\\n librbd1 x86_64 1:10.2.5-4.el7 rhel-7-server-rpms 2.4 M\\n qemu-img x86_64 10:1.5.3-175.el7_9.4 rhel-7-server-rpms 705 k\\n qemu-kvm-common x86_64 10:1.5.3-175.el7_9.4 rhel-7-server-rpms 440 k\\n\\nTransaction Summary\\n================================================================================\\nInstall 2 Packages (+5 Dependent packages)\\n\\nTotal download size: 7.3 M\\nInstalled size: 22 M\\nDownloading packages:\\n'], 'rc': 1, 'invocation': {'module_args': {'lock_timeout': 30, 'update_cache': False, 'disable_excludes': 'None', 'exclude': [], 'allow_downgrade': False, 'disable_gpg_check': False, 'conf_file': 'None', 'use_backend': 'auto', 'state': 'present', 'disablerepo': [], 'releasever': 'None', 'skip_broken': False, 'autoremove': False, 'download_dir': 'None', 'enable_plugin': [], 'installroot': '/', 'install_weak_deps': True, 'name': ['@core', '@base', 'yum-plugin-priorities', 'yum-plugin-fastestmirror', 'redhat-lsb', 'sysstat', 'gdb', 'git-all', 'python-configobj', 'gcc-c++', 'libedit', 'openssl098e', 'boost-thread', 'xfsprogs', 'xfsprogs-devel', 'gdisk', 'parted', 'libgcrypt', 'fuse', 'fuse-libs', 'lvm2', 'openssl', 'libuuid', 'btrfs-progs', 'attr', 'valgrind', 'python-nose', 'mpich', 'ant', 'lsof', 'iozone', 'libtool', 'automake', 'gettext', 'libuuid-devel', 'libacl-devel', 'bc', 'xfsdump', 'blktrace', 'numpy', 'python-matplotlib', 'qemu-kvm', 'usbredir', 'genisoimage', 'httpd', 'httpd-devel', 'httpd-tools', 'mod_ssl', 'mod_fastcgi-2.4.7-1.ceph.el7', 'libev-devel', 'perl-XML-Twig', 'java-1.6.0-openjdk-devel', 'junit4', 'nfs-utils', 'ncurses-devel', 'python-devel', 'python-virtualenv', 'perl-CPAN', 'podman', 'python3'], 'download_only': False, 'bugfix': False, 'list': 'None', 'install_repoquery': True, 'update_only': False, 'disable_plugin': [], 'enablerepo': [], 'security': False, 'validate_certs': True}}, 'changes': {'installed': ['qemu-kvm', 'mod_fastcgi-2.4.7-1.ceph.el7']}, 'msg': "http://gitbuilder.ceph.com/mod_fastcgi-rpm-rhel7-x86_64-basic/ref/master/repodata/repomd.xml: [Errno 14] HTTP Error 403 - Forbidden\nTrying other mirror.\nTo address this issue please refer to the below knowledge base article\n\nhttps://access.redhat.com/solutions/69319\n\nIf above article doesn't help to resolve this issue please open a ticket with Red Hat Support.\n\nhttp://gitbuilder.ceph.com/mod_fastcgi-rpm-rhel7-x86_64-basic/ref/master/x86_64/mod_fastcgi-2.4.7-1.ceph.el7.x86_64.rpm: [Errno 14] HTTP Error 403 - Forbidden\nTrying other mirror.\n\n\nError downloading packages:\n mod_fastcgi-2.4.7-1.ceph.el7.x86_64: [Errno 256] No more mirrors to try.\n\n", '_ansible_no_log': False}}, 'Traceback (most recent call last)': 'File "/home/teuthworker/src/git.ceph.com_git_ceph-cm-ansible_master/callback_plugins/failure_log.py", line 44, in log_failure log.error(yaml.safe_dump(failure)) File "/home/teuthworker/src/git.ceph.com_git_teuthology_b6f3efab84b70e18e86ec271a07564aeb4ed3bac/virtualenv/lib/python3.6/site-packages/yaml/__init__.py", line 306, in safe_dump return dump_all([data], stream, Dumper=SafeDumper, **kwds) File "/home/teuthworker/src/git.ceph.com_git_teuthology_b6f3efab84b70e18e86ec271a07564aeb4ed3bac/virtualenv/lib/python3.6/site-packages/yaml/__init__.py", line 278, in dump_all dumper.represent(data) File "/home/teuthworker/src/git.ceph.com_git_teuthology_b6f3efab84b70e18e86ec271a07564aeb4ed3bac/virtualenv/lib/python3.6/site-packages/yaml/representer.py", line 27, in represent node = self.represent_data(data) File "/home/teuthworker/src/git.ceph.com_git_teuthology_b6f3efab84b70e18e86ec271a07564aeb4ed3bac/virtualenv/lib/python3.6/site-packages/yaml/representer.py", line 48, in represent_data node = self.yaml_representers[data_types[0]](self, data) File "/home/teuthworker/src/git.ceph.com_git_teuthology_b6f3efab84b70e18e86ec271a07564aeb4ed3bac/virtualenv/lib/python3.6/site-packages/yaml/representer.py", line 207, in represent_dict return self.represent_mapping(\'tag:yaml.org,2002:map\', data) File "/home/teuthworker/src/git.ceph.com_git_teuthology_b6f3efab84b70e18e86ec271a07564aeb4ed3bac/virtualenv/lib/python3.6/site-packages/yaml/representer.py", line 118, in represent_mapping node_value = self.represent_data(item_value) File "/home/teuthworker/src/git.ceph.com_git_teuthology_b6f3efab84b70e18e86ec271a07564aeb4ed3bac/virtualenv/lib/python3.6/site-packages/yaml/representer.py", line 48, in represent_data node = self.yaml_representers[data_types[0]](self, data) File "/home/teuthworker/src/git.ceph.com_git_teuthology_b6f3efab84b70e18e86ec271a07564aeb4ed3bac/virtualenv/lib/python3.6/site-packages/yaml/representer.py", line 207, in represent_dict return self.represent_mapping(\'tag:yaml.org,2002:map\', data) File "/home/teuthworker/src/git.ceph.com_git_teuthology_b6f3efab84b70e18e86ec271a07564aeb4ed3bac/virtualenv/lib/python3.6/site-packages/yaml/representer.py", line 117, in represent_mapping node_key = self.represent_data(item_key) File "/home/teuthworker/src/git.ceph.com_git_teuthology_b6f3efab84b70e18e86ec271a07564aeb4ed3bac/virtualenv/lib/python3.6/site-packages/yaml/representer.py", line 58, in represent_data node = self.yaml_representers[None](self, data) File "/home/teuthworker/src/git.ceph.com_git_teuthology_b6f3efab84b70e18e86ec271a07564aeb4ed3bac/virtualenv/lib/python3.6/site-packages/yaml/representer.py", line 231, in represent_undefined raise RepresenterError("cannot represent an object", data)', 'yaml.representer.RepresenterError': "('cannot represent an object', 'changed')"}

dead 6288609 2021-07-23 13:25:40 2021-07-28 12:45:14 2021-07-28 14:35:20 1:50:06 0:08:05 1:42:01 gibba master rhel 7.9 kcephfs/recovery/{begin clusters/1-mds-4-client conf/{client mds mon osd} kclient/{mount overrides/{distro/rhel/{k-distro rhel_latest} ms-die-on-skipped}} objectstore-ec/bluestore-comp overrides/{frag_enable log-config osd-asserts whitelist_health whitelist_wrongly_marked_down} tasks/backtrace} 6
Failure Reason:

{'Failure object was': {'gibba043.front.sepia.ceph.com': {'changed': False, 'results': ['yum-plugin-priorities-1.1.31-54.el7_8.noarch providing yum-plugin-priorities is already installed', 'yum-plugin-fastestmirror-1.1.31-54.el7_8.noarch providing yum-plugin-fastestmirror is already installed', 'redhat-lsb-4.1-27.el7.x86_64 providing redhat-lsb is already installed', 'sysstat-10.1.5-19.el7.x86_64 providing sysstat is already installed', 'gdb-7.6.1-120.el7.x86_64 providing gdb is already installed', 'git-all-1.8.3.1-23.el7_8.noarch providing git-all is already installed', 'python-configobj-4.7.2-7.el7.noarch providing python-configobj is already installed', 'gcc-c++-4.8.5-44.el7.x86_64 providing gcc-c++ is already installed', 'libedit-3.0-12.20121213cvs.el7.x86_64 providing libedit is already installed', 'openssl098e-0.9.8e-29.el7_2.3.x86_64 providing openssl098e is already installed', 'boost-thread-1.53.0-28.el7.x86_64 providing boost-thread is already installed', 'xfsprogs-4.5.0-22.el7.x86_64 providing xfsprogs is already installed', 'xfsprogs-devel-4.5.0-22.el7.x86_64 providing xfsprogs-devel is already installed', 'gdisk-0.8.10-3.el7.x86_64 providing gdisk is already installed', 'parted-3.1-32.el7.x86_64 providing parted is already installed', 'libgcrypt-1.5.3-14.el7.x86_64 providing libgcrypt is already installed', 'fuse-2.9.2-11.el7.x86_64 providing fuse is already installed', 'fuse-libs-2.9.2-11.el7.x86_64 providing fuse-libs is already installed', '7:lvm2-2.02.187-6.el7.x86_64 providing lvm2 is already installed', '1:openssl-1.0.2k-19.el7.x86_64 providing openssl is already installed', 'libuuid-2.23.2-65.el7_9.1.x86_64 providing libuuid is already installed', 'btrfs-progs-4.9.1-1.el7.x86_64 providing btrfs-progs is already installed', 'attr-2.4.46-13.el7.x86_64 providing attr is already installed', '1:valgrind-3.15.0-11.el7.x86_64 providing valgrind is already installed', 'python-nose-1.3.7-1.el7.noarch providing python-nose is already installed', 'mpich-3.0-3.0.4-10.el7.x86_64 providing mpich is already installed', 'ant-1.9.4-2.el7.noarch providing ant is already installed', 'lsof-4.87-6.el7.x86_64 providing lsof is already installed', 'iozone-3.424-2_ceph.el7.x86_64 providing iozone is already installed', 'libtool-2.4.2-22.el7_3.x86_64 providing libtool is already installed', 'automake-1.13.4-3.el7.noarch providing automake is already installed', 'gettext-0.19.8.1-3.el7.x86_64 providing gettext is already installed', 'libuuid-devel-2.23.2-65.el7_9.1.x86_64 providing libuuid-devel is already installed', 'libacl-devel-2.2.51-15.el7.x86_64 providing libacl-devel is already installed', 'bc-1.06.95-13.el7.x86_64 providing bc is already installed', 'xfsdump-3.1.7-1.el7.x86_64 providing xfsdump is already installed', 'blktrace-1.0.5-9.el7.x86_64 providing blktrace is already installed', '1:numpy-1.7.1-13.el7.x86_64 providing numpy is already installed', 'python-matplotlib-1.2.0-16.el7.x86_64 providing python-matplotlib is already installed', 'usbredir-0.7.1-3.el7.x86_64 providing usbredir is already installed', 'genisoimage-1.1.11-25.el7.x86_64 providing genisoimage is already installed', 'httpd-2.4.6-97.el7_9.x86_64 providing httpd is already installed', 'httpd-devel-2.4.6-97.el7_9.x86_64 providing httpd-devel is already installed', 'httpd-tools-2.4.6-97.el7_9.x86_64 providing httpd-tools is already installed', '1:mod_ssl-2.4.6-97.el7_9.x86_64 providing mod_ssl is already installed', 'libev-devel-4.15-7.el7.x86_64 providing libev-devel is already installed', 'perl-XML-Twig-3.44-2.el7.noarch providing perl-XML-Twig is already installed', '1:java-1.6.0-openjdk-devel-1.6.0.41-1.13.13.1.el7_3.x86_64 providing java-1.6.0-openjdk-devel is already installed', 'junit-4.11-8.el7.noarch providing junit4 is already installed', '1:nfs-utils-1.3.0-0.68.el7.x86_64 providing nfs-utils is already installed', 'ncurses-devel-5.9-14.20130511.el7_4.x86_64 providing ncurses-devel is already installed', 'python-devel-2.7.5-90.el7.x86_64 providing python-devel is already installed', 'python-virtualenv-15.1.0-4.el7_8.noarch providing python-virtualenv is already installed', 'perl-CPAN-1.9800-299.el7_9.noarch providing perl-CPAN is already installed', 'podman-1.6.4-29.el7_9.x86_64 providing podman is already installed', 'python3-3.6.8-18.el7.x86_64 providing python3 is already installed', 'Loaded plugins: fastestmirror, langpacks, priorities, product-id, search-\\n : disabled-repos, subscription-manager\\nLoading mirror speeds from cached hostfile\\n * epel: download-cc-rdu01.fedoraproject.org\\nResolving Dependencies\\n--> Running transaction check\\n---> Package mod_fastcgi.x86_64 0:2.4.7-1.ceph.el7 will be installed\\n---> Package qemu-kvm.x86_64 10:1.5.3-175.el7_9.4 will be installed\\n--> Processing Dependency: qemu-kvm-common = 10:1.5.3-175.el7_9.4 for package: 10:qemu-kvm-1.5.3-175.el7_9.4.x86_64\\n--> Processing Dependency: qemu-img = 10:1.5.3-175.el7_9.4 for package: 10:qemu-kvm-1.5.3-175.el7_9.4.x86_64\\n--> Processing Dependency: librbd.so.1()(64bit) for package: 10:qemu-kvm-1.5.3-175.el7_9.4.x86_64\\n--> Processing Dependency: librados.so.2()(64bit) for package: 10:qemu-kvm-1.5.3-175.el7_9.4.x86_64\\n--> Running transaction check\\n---> Package librados2.x86_64 1:10.2.5-4.el7 will be installed\\n--> Processing Dependency: libboost_random-mt.so.1.53.0()(64bit) for package: 1:librados2-10.2.5-4.el7.x86_64\\n---> Package librbd1.x86_64 1:10.2.5-4.el7 will be installed\\n---> Package qemu-img.x86_64 10:1.5.3-175.el7_9.4 will be installed\\n---> Package qemu-kvm-common.x86_64 10:1.5.3-175.el7_9.4 will be installed\\n--> Running transaction check\\n---> Package boost-random.x86_64 0:1.53.0-28.el7 will be installed\\n--> Finished Dependency Resolution\\n\\nDependencies Resolved\\n\\n================================================================================\\n Package Arch Version Repository Size\\n================================================================================\\nInstalling:\\n mod_fastcgi x86_64 2.4.7-1.ceph.el7 rhel-7-fcgi-ceph 70 k\\n qemu-kvm x86_64 10:1.5.3-175.el7_9.4 rhel-7-server-rpms 1.9 M\\nInstalling for dependencies:\\n boost-random x86_64 1.53.0-28.el7 rhel-7-server-rpms 39 k\\n librados2 x86_64 1:10.2.5-4.el7 rhel-7-server-rpms 1.8 M\\n librbd1 x86_64 1:10.2.5-4.el7 rhel-7-server-rpms 2.4 M\\n qemu-img x86_64 10:1.5.3-175.el7_9.4 rhel-7-server-rpms 705 k\\n qemu-kvm-common x86_64 10:1.5.3-175.el7_9.4 rhel-7-server-rpms 440 k\\n\\nTransaction Summary\\n================================================================================\\nInstall 2 Packages (+5 Dependent packages)\\n\\nTotal download size: 7.3 M\\nInstalled size: 22 M\\nDownloading packages:\\n'], 'rc': 1, 'invocation': {'module_args': {'lock_timeout': 30, 'update_cache': False, 'disable_excludes': 'None', 'exclude': [], 'allow_downgrade': False, 'disable_gpg_check': False, 'conf_file': 'None', 'use_backend': 'auto', 'state': 'present', 'disablerepo': [], 'releasever': 'None', 'skip_broken': False, 'autoremove': False, 'download_dir': 'None', 'enable_plugin': [], 'installroot': '/', 'install_weak_deps': True, 'name': ['@core', '@base', 'yum-plugin-priorities', 'yum-plugin-fastestmirror', 'redhat-lsb', 'sysstat', 'gdb', 'git-all', 'python-configobj', 'gcc-c++', 'libedit', 'openssl098e', 'boost-thread', 'xfsprogs', 'xfsprogs-devel', 'gdisk', 'parted', 'libgcrypt', 'fuse', 'fuse-libs', 'lvm2', 'openssl', 'libuuid', 'btrfs-progs', 'attr', 'valgrind', 'python-nose', 'mpich', 'ant', 'lsof', 'iozone', 'libtool', 'automake', 'gettext', 'libuuid-devel', 'libacl-devel', 'bc', 'xfsdump', 'blktrace', 'numpy', 'python-matplotlib', 'qemu-kvm', 'usbredir', 'genisoimage', 'httpd', 'httpd-devel', 'httpd-tools', 'mod_ssl', 'mod_fastcgi-2.4.7-1.ceph.el7', 'libev-devel', 'perl-XML-Twig', 'java-1.6.0-openjdk-devel', 'junit4', 'nfs-utils', 'ncurses-devel', 'python-devel', 'python-virtualenv', 'perl-CPAN', 'podman', 'python3'], 'download_only': False, 'bugfix': False, 'list': 'None', 'install_repoquery': True, 'update_only': False, 'disable_plugin': [], 'enablerepo': [], 'security': False, 'validate_certs': True}}, 'changes': {'installed': ['qemu-kvm', 'mod_fastcgi-2.4.7-1.ceph.el7']}, 'msg': "http://gitbuilder.ceph.com/mod_fastcgi-rpm-rhel7-x86_64-basic/ref/master/repodata/repomd.xml: [Errno 14] HTTP Error 403 - Forbidden\nTrying other mirror.\nTo address this issue please refer to the below knowledge base article\n\nhttps://access.redhat.com/solutions/69319\n\nIf above article doesn't help to resolve this issue please open a ticket with Red Hat Support.\n\nhttp://gitbuilder.ceph.com/mod_fastcgi-rpm-rhel7-x86_64-basic/ref/master/x86_64/mod_fastcgi-2.4.7-1.ceph.el7.x86_64.rpm: [Errno 14] HTTP Error 403 - Forbidden\nTrying other mirror.\n\n\nError downloading packages:\n mod_fastcgi-2.4.7-1.ceph.el7.x86_64: [Errno 256] No more mirrors to try.\n\n", '_ansible_no_log': False}}, 'Traceback (most recent call last)': 'File "/home/teuthworker/src/git.ceph.com_git_ceph-cm-ansible_master/callback_plugins/failure_log.py", line 44, in log_failure log.error(yaml.safe_dump(failure)) File "/home/teuthworker/src/git.ceph.com_git_teuthology_b6f3efab84b70e18e86ec271a07564aeb4ed3bac/virtualenv/lib/python3.6/site-packages/yaml/__init__.py", line 306, in safe_dump return dump_all([data], stream, Dumper=SafeDumper, **kwds) File "/home/teuthworker/src/git.ceph.com_git_teuthology_b6f3efab84b70e18e86ec271a07564aeb4ed3bac/virtualenv/lib/python3.6/site-packages/yaml/__init__.py", line 278, in dump_all dumper.represent(data) File "/home/teuthworker/src/git.ceph.com_git_teuthology_b6f3efab84b70e18e86ec271a07564aeb4ed3bac/virtualenv/lib/python3.6/site-packages/yaml/representer.py", line 27, in represent node = self.represent_data(data) File "/home/teuthworker/src/git.ceph.com_git_teuthology_b6f3efab84b70e18e86ec271a07564aeb4ed3bac/virtualenv/lib/python3.6/site-packages/yaml/representer.py", line 48, in represent_data node = self.yaml_representers[data_types[0]](self, data) File "/home/teuthworker/src/git.ceph.com_git_teuthology_b6f3efab84b70e18e86ec271a07564aeb4ed3bac/virtualenv/lib/python3.6/site-packages/yaml/representer.py", line 207, in represent_dict return self.represent_mapping(\'tag:yaml.org,2002:map\', data) File "/home/teuthworker/src/git.ceph.com_git_teuthology_b6f3efab84b70e18e86ec271a07564aeb4ed3bac/virtualenv/lib/python3.6/site-packages/yaml/representer.py", line 118, in represent_mapping node_value = self.represent_data(item_value) File "/home/teuthworker/src/git.ceph.com_git_teuthology_b6f3efab84b70e18e86ec271a07564aeb4ed3bac/virtualenv/lib/python3.6/site-packages/yaml/representer.py", line 48, in represent_data node = self.yaml_representers[data_types[0]](self, data) File "/home/teuthworker/src/git.ceph.com_git_teuthology_b6f3efab84b70e18e86ec271a07564aeb4ed3bac/virtualenv/lib/python3.6/site-packages/yaml/representer.py", line 207, in represent_dict return self.represent_mapping(\'tag:yaml.org,2002:map\', data) File "/home/teuthworker/src/git.ceph.com_git_teuthology_b6f3efab84b70e18e86ec271a07564aeb4ed3bac/virtualenv/lib/python3.6/site-packages/yaml/representer.py", line 117, in represent_mapping node_key = self.represent_data(item_key) File "/home/teuthworker/src/git.ceph.com_git_teuthology_b6f3efab84b70e18e86ec271a07564aeb4ed3bac/virtualenv/lib/python3.6/site-packages/yaml/representer.py", line 58, in represent_data node = self.yaml_representers[None](self, data) File "/home/teuthworker/src/git.ceph.com_git_teuthology_b6f3efab84b70e18e86ec271a07564aeb4ed3bac/virtualenv/lib/python3.6/site-packages/yaml/representer.py", line 231, in represent_undefined raise RepresenterError("cannot represent an object", data)', 'yaml.representer.RepresenterError': "('cannot represent an object', 'changed')"}

pass 6288568 2021-07-23 08:01:05 2021-07-23 09:50:40 2021-07-23 10:24:26 0:33:46 0:17:34 0:16:12 gibba master ubuntu 20.04 smoke/basic/{clusters/{fixed-3-cephfs openstack} objectstore/bluestore-bitmap supported-random-distro$/{ubuntu_latest} tasks/rgw_s3tests} 3
pass 6288564 2021-07-23 08:01:02 2021-07-23 09:27:47 2021-07-23 09:55:08 0:27:21 0:08:36 0:18:45 gibba master ubuntu 20.04 smoke/basic/{clusters/{fixed-3-cephfs openstack} objectstore/bluestore-bitmap supported-random-distro$/{ubuntu_latest} tasks/rbd_fsx} 3
pass 6288560 2021-07-23 08:00:59 2021-07-23 09:11:44 2021-07-23 09:35:47 0:24:03 0:12:33 0:11:30 gibba master ubuntu 18.04 smoke/basic/{clusters/{fixed-3-cephfs openstack} objectstore/bluestore-bitmap supported-random-distro$/{ubuntu_18.04} tasks/rados_python} 3
pass 6288555 2021-07-23 08:00:55 2021-07-23 08:40:30 2021-07-23 09:12:25 0:31:55 0:20:56 0:10:59 gibba master centos 8.3 smoke/basic/{clusters/{fixed-3-cephfs openstack} objectstore/bluestore-bitmap supported-random-distro$/{centos_8} tasks/rados_api_tests} 3
pass 6288549 2021-07-23 08:00:50 2021-07-23 08:17:34 2021-07-23 08:41:32 0:23:58 0:08:45 0:15:13 gibba master centos 8.3 smoke/basic/{clusters/{fixed-3-cephfs openstack} objectstore/bluestore-bitmap supported-random-distro$/{centos_8} tasks/kclient_workunit_direct_io} 3
pass 6287944 2021-07-23 03:22:19 2021-07-27 04:07:13 2021-07-27 04:36:56 0:29:43 0:14:38 0:15:05 gibba master krbd/rbd-nomount/{bluestore-bitmap clusters/fixed-3 conf install/ceph ms_mode/legacy msgr-failures/few tasks/krbd_udev_netlink_enobufs} 3
pass 6287938 2021-07-23 03:22:15 2021-07-27 03:44:08 2021-07-27 04:09:37 0:25:29 0:13:03 0:12:26 gibba master krbd/rbd-nomount/{bluestore-bitmap clusters/fixed-3 conf install/ceph ms_mode/legacy msgr-failures/many tasks/krbd_latest_osdmap_on_map} 3
pass 6287928 2021-07-23 03:22:08 2021-07-27 03:04:11 2021-07-27 03:44:14 0:40:03 0:26:40 0:13:23 gibba master krbd/fsx/{ceph/ceph clusters/3-node conf features/object-map ms_mode$/{secure} objectstore/bluestore-bitmap striping/default/{msgr-failures/few randomized-striping-off} tasks/fsx-1-client} 3
pass 6287906 2021-07-23 03:21:53 2021-07-27 01:45:24 2021-07-27 03:04:53 1:19:29 1:05:49 0:13:40 gibba master krbd/rbd/{bluestore-bitmap clusters/fixed-3 conf ms_mode/legacy msgr-failures/many tasks/rbd_workunit_suites_ffsb} 3
pass 6287898 2021-07-23 03:21:47 2021-07-27 01:20:59 2021-07-27 01:45:25 0:24:26 0:09:37 0:14:49 gibba master krbd/rbd-nomount/{bluestore-bitmap clusters/fixed-3 conf install/ceph ms_mode/crc msgr-failures/few tasks/krbd_fallocate} 3